Student Services Fee
type: Concept
definition: Cost for student services related to the learning opportunity.
term status: stable
change history: https://credreg.net/ctdl/termhistory/costType/StudentServicesFee/json
in scheme: CostType
top concept of: CostType