Suspended
type: Concept
definition: Awards of the credential are not available, but may resume.
term status: stable
change history: https://credreg.net/ctdl/termhistory/credentialStat/Suspended/json
in scheme: CredentialStatus
top concept of: CredentialStatus