Clock Hour
type: Concept
definition: Credit that is issued or accepted as being related to one or more temporal hours.
term status: stable
change history: https://credreg.net/ctdl/termhistory/creditUnit/ClockHour/json
broader: TimeBasedCredit
in scheme: CreditUnit