Semester Hour
type: Concept
definition: Credit that is issued or accepted at a semester level.
term status: stable
change history: https://credreg.net/ctdl/termhistory/creditUnit/SemesterHour/json
broader: TimeBasedCredit
in scheme: CreditUnit