Time-Based Credit
type: Concept
definition: Credit with a unit of measurement based on time, either figuratively or literally.
term status: stable
change history: https://credreg.net/ctdl/termhistory/creditUnit/TimeBasedCredit/json
in scheme: CreditUnit
top concept of: CreditUnit
narrower: AcademicYear
narrower: CarnegieUnit
narrower: ClockHour
narrower: ContactHour
narrower: QuarterHour
narrower: SemesterHour