Type-Based Credit
type: Concept
definition: Credit with a unit of measurement based on the type of credit.
term status: stable
change history: https://credreg.net/ctdl/termhistory/creditUnit/TypeBasedCredit/json
in scheme: CreditUnit
top concept of: CreditUnit
narrower: CertificateCredit
narrower: CompetencyCredit
narrower: ContinuingEducationUnit
narrower: DegreeCredit
narrower: DualCredit
narrower: RequirementCredit
narrower: SecondaryDiplomaCredit