Blended Delivery
type: Concept
definition: Delivery includes significant levels of both in person and online.
term status: stable
change history: https://credreg.net/ctdl/termhistory/deliveryType/BlendedDelivery/json
in scheme: Delivery
top concept of: Delivery