Academic Assistantship
type: Concept
definition: Paid employment in which students receive tuition or other reimbursement for the tasks they perform for faculty members, departments, and/or educational institutions.
term status: stable
change history: https://credreg.net/ctdl/termhistory/financialAid/AcademicAssistantship/json
broader: WorkBased
equivalent class: Assistantships
in scheme: FinancialAssistance