Apprenticeship
type: Concept
definition: Combination of on-the-job training and related instruction that meets standards in which workers learn the practical and theoretical aspects of a skilled occupation.
term status: stable
change history: https://credreg.net/ctdl/termhistory/financialAid/Apprenticeship/json
broader: WorkBased
in scheme: FinancialAssistance