Department of Defense Tuition Assistance
type: Concept
definition: Financial assistance provided to qualified active duty service members and their families for voluntary off-duty educational programs in support of professional and personal self-development goals.
term status: stable
change history: https://credreg.net/ctdl/termhistory/financialAid/DoDTuitionAssistance/json
broader: Military
equivalent class: DODTuitionAssistance
in scheme: FinancialAssistance