General Financial Assistance
type: Concept
definition: Types of financial assistance for students towards education, training, or related costs of pursuing a credential, program, or other resource.
term status: stable
change history: https://credreg.net/ctdl/termhistory/financialAid/General/json
equivalent class: https://ceds.ed.gov/element/000113
in scheme: FinancialAssistance
top concept of: FinancialAssistance
narrower: Grant
narrower: Loan
narrower: Scholarship
narrower: WorkBased