Grant
type: Concept
definition: Financial subsidy, which doesn’t require repayment, based on meeting requirements determined by the grantor.
term status: stable
change history: https://credreg.net/ctdl/termhistory/financialAid/Grant/json
broader: General
in scheme: FinancialAssistance
narrower: FederalGrant
narrower: InstitutionalGrant
narrower: LoanForgivenessProgram
narrower: OtherGrant
narrower: PellGrant
narrower: PrivateGrant
narrower: PromiseProgram
narrower: StateLocalGrant
narrower: WIOA