Internship
type: Concept
definition: Time-limited work offered by an organization approved by a qualified institution to gain experience or satisfy requirements for another resource.
term status: stable
change history: https://credreg.net/ctdl/termhistory/financialAid/Internship/json
broader: WorkBased
in scheme: FinancialAssistance