Loan
type: Concept
definition: Financial aid that requires repayment with terms determined by the entity providing the loan.
term status: stable
change history: https://credreg.net/ctdl/termhistory/financialAid/Loan/json
broader: General
in scheme: FinancialAssistance
narrower: FederalSubsidizedLoan
narrower: FederalUnsubsidizedLoan
narrower: InstitutionalLoan
narrower: OtherLoan
narrower: ParentPLUSLoan
narrower: PrivateLoan
narrower: StateLocalLoan