Loan Forgiveness Program
type: Concept
definition: Program that forgives the remaining balance on a loan after meeting certain requirements.
term status: stable
change history: https://credreg.net/ctdl/termhistory/financialAid/LoanForgivenessProgram/json
broader: Grant
in scheme: FinancialAssistance