Other Grant
type: Concept
definition: Financial subsidy based on meeting requirements from one or more other sources.
term status: stable
change history: https://credreg.net/ctdl/termhistory/financialAid/OtherGrant/json
broader: Grant
equivalent class: OtherGrants
in scheme: FinancialAssistance