Other On-Campus Work
type: Concept
definition: Paid non-academic employment available for students on an educational institution’s campus.
term status: stable
change history: https://credreg.net/ctdl/termhistory/financialAid/OtherOnCampusWork/json
broader: WorkBased
equivalent class: OtherOnCampusWork
in scheme: FinancialAssistance