Other Scholarship
type: Concept
definition: Financial aid award, which doesn’t require repayment, from one or more other sources based on student achievement and other criteria.
term status: stable
change history: https://credreg.net/ctdl/termhistory/financialAid/OtherScholarship/json
broader: Scholarship
equivalent class: OtherScholarships
in scheme: FinancialAssistance