Parent PLUS Loan
type: Concept
definition: Loan from the Federal Government available to the parents of dependent students.
term status: stable
change history: https://credreg.net/ctdl/termhistory/financialAid/ParentPLUSLoan/json
broader: Loan
equivalent class: ParentPLUSLoans
in scheme: FinancialAssistance