Pell Grant
type: Concept
definition: Financial subsidy, which doesn’t require repayment, that the Federal Government provides based on the financial needs of the student.
term status: stable
change history: https://credreg.net/ctdl/termhistory/financialAid/PellGrant/json
broader: Grant
equivalent class: PellGrants
in scheme: FinancialAssistance