Private Grant
type: Concept
definition: Financial subsidy, which doesn’t require repayment, based on meeting requirements determined by a private entity, including employers.
term status: stable
change history: https://credreg.net/ctdl/termhistory/financialAid/PrivateGrant/json
broader: Grant
equivalent class: PrivateGrants
in scheme: FinancialAssistance