Private Scholarship
type: Concept
definition: Financial aid award, which doesn’t require repayment, from a private entity, including employers, based on student achievement and other criteria for education.
term status: stable
change history: https://credreg.net/ctdl/termhistory/financialAid/PrivateScholarship/json
broader: Scholarship
equivalent class: PrivateScholarships
in scheme: FinancialAssistance