Scholarship
type: Concept
definition: Financial aid award based on student achievement and other criteria for education that doesn’t require repayment.
term status: stable
change history: https://credreg.net/ctdl/termhistory/financialAid/Scholarship/json
broader: General
in scheme: FinancialAssistance
narrower: FederalScholarship
narrower: InstitutionalScholarship
narrower: OtherScholarship
narrower: PrivateScholarship
narrower: StateLocalScholarship