State or Local Grant
type: Concept
definition: Financial subsidy, which doesn’t require repayment, based on meeting requirements determined by a state, province, region, and/or local government.
term status: stable
change history: https://credreg.net/ctdl/termhistory/financialAid/StateLocalGrant/json
broader: Grant
equivalent class: StateAndLocalGrants
in scheme: FinancialAssistance