State or Local Loan
type: Concept
definition: Loan from a state, province, region, and/or local government that is intended to offset costs related to education, living, and resources.
term status: stable
change history: https://credreg.net/ctdl/termhistory/financialAid/StateLocalLoan/json
broader: Loan
equivalent class: StateLoans
in scheme: FinancialAssistance