State or Local Military Assistance
type: Concept
definition: Financial aid provided by a state or local government to active duty service members, veterans, and/or qualified family members.
term status: stable
change history: https://credreg.net/ctdl/termhistory/financialAid/StateLocalMilitaryAssistance/json
broader: Military
in scheme: FinancialAssistance