Veteran Educational Assistance Program
type: Concept
definition: Financial assistance provided to qualified active duty service members and veterans as a matching program that is intended to offset educational expenses.
term status: stable
change history: https://credreg.net/ctdl/termhistory/financialAid/VEAP/json
broader: Military
in scheme: FinancialAssistance