Vocational Rehabilitation
type: Concept
definition: Financial for veterans with a qualifying service-connected disability rating for training or education related to pursuit of a career or career-related resource.
term status: stable
change history: https://credreg.net/ctdl/termhistory/financialAid/VocationalRehabilitation/json
broader: Military
in scheme: FinancialAssistance