Committee
type: Concept
definition: External stakeholder review, guidance or recommendations by a group of individuals convened to represent a larger group or range of stakeholders.
term status: unstable
change history: https://credreg.net/ctdl/termhistory/inputType/Committee/json
in scheme: ExternalInput
top concept of: ExternalInput