Students
type: Concept
definition: External stakeholder review, guidance or recommendations by all types of learners.
term status: stable
change history: https://credreg.net/ctdl/termhistory/inputType/Students/json
in scheme: ExternalInput
top concept of: ExternalInput