Competency Based
type: Concept
definition: Method that focuses on learners demonstrating the knowledge, skills and/or attitudes in highly specific units regardless of time, place, or pace of learning, usually in authentic contexts.
description: This definition is based on Commonwealth of Learning (COL) "Open and Distance Learning: Key Terms and Definitions" (May 2023) http://hdl.handle.net/11599/3558
term status: unstable
change history: https://credreg.net/ctdl/termhistory/learnMethod/CompetencyBased/json
in scheme: LearningMethod
top concept of: LearningMethod