Electronic Media Based
type: Concept
definition: Delivery of learning material via one-way broadcast or storage media.
description: Applies to methods such as television, radio, Internet, fax, distributed media, and gaming.
term status: deprecated
change history: https://credreg.net/ctdl/termhistory/learnMethod/ElectronicMediaBased/json
in scheme: LearningMethod
top concept of: LearningMethod