Prerecorded
type: Concept
definition: Learning by using video, audio, or other prerecorded content.
term status: stable
change history: https://credreg.net/ctdl/termhistory/learnMethod/Prerecorded/json
in scheme: LearningMethod
top concept of: LearningMethod