Military Transcript
type: Concept
definition: Official record of a person’s military education, training, occupations, and related evaluations.
term status: unstable
change history: https://credreg.net/ctdl/termhistory/lrEvidence/MilitaryTranscript/json
in scheme: LearningRecognitionEvidenceCategory
top concept of: LearningRecognitionEvidenceCategory