Community Service
type: Concept
definition: Learning acquired through unpaid service activities performed for the benefit of a community or organization outside a formal curriculum or assessed program.
term status: unstable
change history: https://credreg.net/ctdl/termhistory/lrSource/CommunityService/json
in scheme: LearningRecognitionSourceCategory
top concept of: LearningRecognitionSourceCategory