Business
type: Concept
definition: Organization that primarily sells products or services and employs one or more individuals.
term status: stable
change history: https://credreg.net/ctdl/termhistory/orgType/Business/json
in scheme: OrganizationType
top concept of: OrganizationType