Business or Industry Association
type: Concept
definition: Membership organization primarily engaged in promoting the interests of their business members and providing them with services that may involve the provision of education and credentialing services.
term status: stable
change history: https://credreg.net/ctdl/termhistory/orgType/BusinessAssociation/json
in scheme: OrganizationType
top concept of: OrganizationType