Alternative/Non-Traditional School
type: Concept
definition: Secondary (i.e., high school) that: 1) addresses needs of students which cannot typically be met in a regular school; 2) provides nontraditional education; 3) falls outside of the categories of regular, magnet/special program emphasis, or career and technical education.
term status: stable
change history: https://credreg.net/ctdl/termhistory/orgType/NonTraditional/json
broader: SecondarySchool
in scheme: OrganizationType