Postsecondary Educational Institution
type: Concept
definition: Organization such as a college or university.
description: Organization with the authority to award degrees, and whose primary purpose is to provide postsecondary (tertiary or non-tertiary) education including programs whose purpose is providing academic, vocational, and continuing professional education.
term status: stable
change history: https://credreg.net/ctdl/termhistory/orgType/Postsecondary/json
in scheme: OrganizationType
top concept of: OrganizationType
narrower: FourYear
narrower: TwoYear