Primarily Online
type: Concept
definition: Organization that primarily operates online.
term status: stable
change history: https://credreg.net/ctdl/termhistory/orgType/PrimarilyOnline/json
in scheme: OrganizationType
top concept of: OrganizationType