Quality Assurance Body
type: Concept
definition: External body that performs accreditation, endorsement, approval, and/or recognition of a credential issuer.
term status: stable
change history: https://credreg.net/ctdl/termhistory/orgType/QualityAssurance/json
in scheme: OrganizationType
top concept of: OrganizationType