Secondary School
type: Concept
definition: Secondary school primarily providing education to students at the ninth grade or higher.
term status: stable
change history: https://credreg.net/ctdl/termhistory/orgType/SecondarySchool/json
in scheme: OrganizationType
top concept of: OrganizationType
narrower: HighSchool
narrower: Magnet
narrower: NonTraditional
narrower: Technical