Education and Training Provider
type: Concept
definition: Organization whose major purpose is to provide education and training services but is not a postsecondary education institution with the authority to award degrees.
description: Includes community-based organizations, non-degree granting proprietary schools which are education and training providers that are recognized by states as schools.
usage note: In the U.S., use for Title IV eligible organizations that do not award degrees.
term status: stable
change history: https://credreg.net/ctdl/termhistory/orgType/TrainingProvider/json
in scheme: OrganizationType
top concept of: OrganizationType