Foreign/International
type: Concept
definition: Legal residency, domicile, or citizen status of the agent is as a foreign national.
term status: stable
change history: https://credreg.net/ctdl/termhistory/residency/International/json
in scheme: Residency
top concept of: Residency