Local
type: Concept
definition: Legal residency or domicile status of the agent is local.
term status: stable
change history: https://credreg.net/ctdl/termhistory/residency/Local/json
in scheme: Residency
top concept of: Residency