Out-of-State
type: Concept
definition: Legal residency or domicile status of the agent is a state or province different from the state or provincial locus of the relevant activity.
term status: stable
change history: https://credreg.net/ctdl/termhistory/residency/OutOfState/json
in scheme: Residency
top concept of: Residency