Weekdays
type: Concept
definition: Schedule is Monday through Friday, consecutively or non-consecutively.
term status: unstable
change history: https://credreg.net/ctdl/termhistory/scheduleTiming/Weekdays/json
in scheme: ScheduleTiming
top concept of: ScheduleTiming