Criterion-Referenced
type: Concept
definition: Scored based on a comparison to defined criteria and levels of performance.
term status: stable
change history: https://credreg.net/ctdl/termhistory/score/CriterionReferenced/json
in scheme: ScoringMethod
top concept of: ScoringMethod