Norm-Referenced
type: Concept
definition: Scored based on a comparison to a distribution of performance in a reference population.
term status: stable
change history: https://credreg.net/ctdl/termhistory/score/NormReferenced/json
in scheme: ScoringMethod
top concept of: ScoringMethod