Accredit Service
type: Concept
definition: Agent service provides official authorization to, or approval of, a credential, organization or program based on prescribed standards or criteria.
term status: stable
change history: https://credreg.net/ctdl/termhistory/serviceType/AccreditService/json
in scheme: AgentServiceType
top concept of: AgentServiceType